Target
Integrin alpha-IIb/beta-3
Ligand
BDBM50078442
Substrate
Meas. Tech.
ChEMBL_70316 (CHEMBL678021)
Kd
2.2±n/a nM
Citation
 Egbertson, MSCook, JJBednar, BPrugh, JDBednar, RAGaul, SLGould, RJHartman, GDHomnick, CFHolahan, MALibby, LALynch, JJLynch, RJSitko, GRStranieri, MTVassallo, LM Non-peptide GPIIb/IIIa inhibitors. 20. Centrally constrained thienothiophene alpha-sulfonamides are potent, long acting in vivo inhibitors of platelet aggregation. J Med Chem 42:2409-21 (1999)  
Target
Name:
Integrin alpha-IIb/beta-3
Synonyms:
Glycoprotein IIb/IIIa
Type:
Mol. Mass.:
Description:
ASSAY_ID of EBI is 30109
Components:
This complex has 2 components.
Component 1
Name:
Integrin beta-3
Synonyms:
CD_antigen=CD61 GPIIIa ITGB3 Platelet membrane glycoprotein IIIa
Type:
Protein
Mol. Mass.:
87038.91
Organism:
Homo sapiens (Human)
Description:
P05106
Residue:
788
  
Component 2
Name:
Integrin alpha-IIb
Synonyms:
CD_antigen=CD41 GPIIb Glycoprotein IIb ITGA2B Integrin alpha-IIb heavy chain Integrin alpha-IIb light chain, form 2 Integrin alpha-V/beta-3 and alpha-IIb/beta 3 | Platelet membrane glycoprotein IIb
Type:
Protein
Mol. Mass.:
113354.85
Organism:
Homo sapiens (Human)
Description:
P08514
Residue:
1039
  
Inhibitor
Name:
BDBM50078442
Synonyms:
(S)-3-{[3-Oxo-2-(2-piperidin-4-yl-ethyl)-2,3-dihydro-1H-isoindole-5-carbonyl]-amino}-2-(pyridine-3-sulfonylamino)-propionic acid CHEMBL79294 | L-746233
Type:
Small organic molecule
Emp. Form.:
C24H29N5O6S
Mol. Mass.:
515.582
SMILES:
OC(=O)[C@H](CNC(=O)c1ccc2CN(CCC3CCNCC3)C(=O)c2c1)NS(=O)(=O)c1cccnc1
: