Target
Purine nucleoside phosphorylase
Ligand
BDBM50048046
Substrate
Meas. Tech.
ChEMBL_162028 (CHEMBL873419)
Ki
3.3±n/a nM
Citation
 Farutin, VMasterson, LAndricopulo, ADCheng, JRiley, BHakimi, RFrazer, JWCordes, EH Structure-activity relationships for a class of inhibitors of purine nucleoside phosphorylase. J Med Chem 42:2422-31 (1999)  
Target
Name:
Purine nucleoside phosphorylase
Synonyms:
Inosine phosphorylase PNP Purine Nucleoside Phosphorylase (PNP) | Purine nucleoside phosphorylase
Type:
Enzyme
Mol. Mass.:
32035.18
Organism:
Bos taurus (bovine)
Description:
Residue:
289
  
Inhibitor
Name:
BDBM50048046
Synonyms:
2-Amino-7-(3-methyl-cyclohexylmethyl)-3,5-dihydro-pyrrolo[3,2-d]pyrimidin-4-one | CHEMBL56540
Type:
Small organic molecule
Emp. Form.:
C14H20N4O
Mol. Mass.:
260.3348
SMILES:
CC1CCCC(Cc2c[nH]c3c2nc(N)[nH]c3=O)C1
: