Target
Bifunctional dihydrofolate reductase-thymidylate synthase
Ligand
BDBM50078470
Substrate
Meas. Tech.
ChEMBL_53316 (CHEMBL665700)
IC50
5.4±n/a nM
Citation
 Gangjee, AAdair, OQueener, SF Pneumocystis carinii and Toxoplasma gondii dihydrofolate reductase inhibitors and antitumor agents: synthesis and biological activities of 2,4-diamino-5-methyl-6-[(monosubstituted anilino)methyl] pyrido[2,3-d]pyrimidines. J Med Chem 42:2447-55 (1999)  
Target
Name:
Bifunctional dihydrofolate reductase-thymidylate synthase
Synonyms:
DHFR-TS Dihydrofolate reductase Dihydrofolate reductase; T. gondii vs rat
Type:
Enzyme
Mol. Mass.:
68757.49
Organism:
Toxoplasma gondii
Description:
Q07422
Residue:
610
  
Inhibitor
Name:
BDBM50078470
Synonyms:
6-{[(4-Chloro-phenyl)-methyl-amino]-methyl}-5-methyl-pyrido[2,3-d]pyrimidine-2,4-diamine | CHEMBL310880
Type:
Small organic molecule
Emp. Form.:
C16H17ClN6
Mol. Mass.:
328.799
SMILES:
CN(Cc1cnc2nc(N)nc(N)c2c1C)c1ccc(Cl)cc1
: