Target
Glutamate receptor ionotropic, NMDA 1
Ligand
BDBM50001266
Substrate
Meas. Tech.
ChEMBL_140710 (CHEMBL751880)
EC50
330±n/a nM
Citation
 Catarzi, DColotta, VVarano, FCecchi, LFilacchioni, GGalli, ACostagli, C 4,5-Dihydro-1,2,4-triazolo[1,5-a]quinoxalin-4-ones: excitatory amino acid antagonists with combined glycine/NMDA and AMPA receptor affinity. J Med Chem 42:2478-84 (1999)  
Target
Name:
Glutamate receptor ionotropic, NMDA 1
Synonyms:
Glutamate (NMDA) receptor subunit zeta 1 Glutamate-NMDA-Channel Glutamate-NMDA-Polyamine NMDA Nmdar1 | phencyclidine
Type:
Enzyme Catalytic Domain
Mol. Mass.:
105533.40
Organism:
RAT
Description:
P35439
Residue:
938
  
Inhibitor
Name:
BDBM50001266
Synonyms:
5,7-DICHLORO-4-HYDROXYQUINOLINE-2-CARBOXYLIC ACID 5,7-Dichloro-4-hydroxy-quinoline-2-carboxylic acid anion 5,7-Dichloro-4-oxo-1,4-dihydro-quinoline-2-carboxylic acid CHEMBL50267
Type:
Small organic molecule
Emp. Form.:
C10H5Cl2NO3
Mol. Mass.:
258.058
SMILES:
OC(=O)c1cc(O)c2c(Cl)cc(Cl)cc2n1
: