Target
Glutamate receptor ionotropic, NMDA 1
Ligand
BDBM50078510
Substrate
Meas. Tech.
ChEMBL_140710 (CHEMBL751880)
EC50
32500±n/a nM
Citation
 Catarzi, DColotta, VVarano, FCecchi, LFilacchioni, GGalli, ACostagli, C 4,5-Dihydro-1,2,4-triazolo[1,5-a]quinoxalin-4-ones: excitatory amino acid antagonists with combined glycine/NMDA and AMPA receptor affinity. J Med Chem 42:2478-84 (1999)  
Target
Name:
Glutamate receptor ionotropic, NMDA 1
Synonyms:
Glutamate (NMDA) receptor subunit zeta 1 Glutamate-NMDA-Channel Glutamate-NMDA-Polyamine NMDA Nmdar1 | phencyclidine
Type:
Enzyme Catalytic Domain
Mol. Mass.:
105533.40
Organism:
RAT
Description:
P35439
Residue:
938
  
Inhibitor
Name:
BDBM50078510
Synonyms:
8-Chloro-4-oxo-4,5-dihydro-[1,2,4]triazolo[1,5-a]quinoxaline-2-carboxylic acid | CHEMBL79312
Type:
Small organic molecule
Emp. Form.:
C10H5ClN4O3
Mol. Mass.:
264.625
SMILES:
OC(=O)c1nc2n(n1)c1cc(Cl)ccc1[nH]c2=O
: