Target
Prothrombin
Ligand
BDBM50078551
Substrate
Meas. Tech.
ChEBML_208128
IC50
3200±n/a nM
Citation
 Pass, MAbu-Rabie, SBaxter, AConroy, RCoote, SJCraven, APFinch, HHindley, SKelly, HALowdon, AWMcDonald, EMitchell, WLPegg, NAProcopiou, PARamsden, NGThomas, RWalker, DAWatson, NSJhoti, HMooney, CJTang, CMThomas, PJParry, SPatel, C Thrombin inhibitors based on [5,5] trans-fused indane lactams. Bioorg Med Chem Lett 9:1657-62 (1999)  
Target
Name:
Prothrombin
Synonyms:
Activation peptide fragment 1 Coagulation factor II Prothrombin precursor Thrombin heavy chain | Thrombin light chain
Type:
Protein
Mol. Mass.:
70029.57
Organism:
Homo sapiens (Human)
Description:
P00734
Residue:
622
  
Inhibitor
Name:
BDBM50078551
Synonyms:
CHEMBL46365 | [(3R,3aS,8aS)-3-(4-Carbamimidoyl-butyl)-6-(3-diethylcarbamoyl-phenyl)-2-oxo-3,3a,8,8a-tetrahydro-2H-indeno[2,1-b]pyrrol-1-yl]-phosphonic acid diethyl ester
Type:
Small organic molecule
Emp. Form.:
C31H43N4O5P
Mol. Mass.:
582.6707
SMILES:
CCOP(=O)(OCC)N1[C@H]2Cc3cc(ccc3[C@@H]2[C@@H](CCCCC(N)=N)C1=O)-c1cccc(c1)C(=O)N(CC)CC
: