Target
Prothrombin
Ligand
BDBM50078560
Substrate
Meas. Tech.
ChEBML_208128
IC50
4000±n/a nM
Citation
 Pass, MAbu-Rabie, SBaxter, AConroy, RCoote, SJCraven, APFinch, HHindley, SKelly, HALowdon, AWMcDonald, EMitchell, WLPegg, NAProcopiou, PARamsden, NGThomas, RWalker, DAWatson, NSJhoti, HMooney, CJTang, CMThomas, PJParry, SPatel, C Thrombin inhibitors based on [5,5] trans-fused indane lactams. Bioorg Med Chem Lett 9:1657-62 (1999)  
Target
Name:
Prothrombin
Synonyms:
Activation peptide fragment 1 Coagulation factor II Prothrombin precursor Thrombin heavy chain | Thrombin light chain
Type:
Protein
Mol. Mass.:
70029.57
Organism:
Homo sapiens (Human)
Description:
P00734
Residue:
622
  
Inhibitor
Name:
BDBM50078560
Synonyms:
(1S,2R,4aR,6aS,6bS,7R,9aR,10aS)-2-Acetoxy-1,4a,6a,10a-tetramethyl-7-(4-methyl-2-oxo-pent-3-enyl)-8-oxo-2,3,4,4a,4b,5,6,6a,6b,7,8,9a,10,10a,12,12a-hexadecahydro-1H-9-oxa-pentaleno[2,1-a]phenanthrene-1-carboxylic acid | CHEMBL44482
Type:
Small organic molecule
Emp. Form.:
C32H44O7
Mol. Mass.:
540.6876
SMILES:
[#6]\[#6](-[#6])=[#6]\[#6](=O)-[#6]-[#6@@H]-1-[#6@@H]2-[#6@@H](-[#6][C@]3([#6])[#6]-4=[#6]-[#6]-[#6]5[C@]([#6])([#6]-[#6]-[#6@@H](-[#8]-[#6](-[#6])=O)[C@@]5([#6])[#6](-[#8])=O)[#6]-4-[#6]-[#6][C@@]23[#6])-[#8]-[#6]-1=O
: