Target
Collagenase 3
Ligand
BDBM50078669
Substrate
Meas. Tech.
ChEBML_101902
IC50
22±n/a nM
Citation
 Freskos, JNMcDonald, JJMischke, BVMullins, PBShieh, HSStegeman, RAStevens, AM Synthesis and identification of conformationally constrained selective MMP inhibitors. Bioorg Med Chem Lett 9:1757-60 (1999)  
Target
Name:
Collagenase 3
Synonyms:
MMP-13 MMP13_HUMAN Matrix metalloproteinase-13 (MMP-13) | Matrix metalloproteinase-13 (MMP13)
Type:
Enzyme
Mol. Mass.:
53808.06
Organism:
Homo sapiens (Human)
Description:
P45452
Residue:
471
  
Inhibitor
Name:
BDBM50078669
Synonyms:
3-(4-Methoxy-benzenesulfonyl)-cyclohexanethiol | CHEMBL295066
Type:
Small organic molecule
Emp. Form.:
C13H18O3S2
Mol. Mass.:
286.41
SMILES:
COc1ccc(cc1)S(=O)(=O)C1CCCC(S)C1
: