Target
Thiosulfate sulfurtransferase
Ligand
BDBM81348
Substrate
Meas. Tech.
ChEMBL_1891102 (CHEMBL4392929)
IC50
120±n/a nM
Citation
 Stevens, MAbdeen, SSalim, NRay, AMWashburn, AChitre, SSivinski, JPark, YHoang, QQChapman, EJohnson, SM HSP60/10 chaperonin systems are inhibited by a variety of approved drugs, natural products, and known bioactive molecules. Bioorg Med Chem Lett 29:1106-1112 (2019)  
Target
Name:
Thiosulfate sulfurtransferase
Synonyms:
2.8.1.1 THTR_HUMAN Thiosulfate sulfurtransferase
Type:
PROTEIN
Mol. Mass.:
33432.06
Organism:
Homo sapiens
Description:
ChEMBL_118080
Residue:
297
  
Inhibitor
Name:
BDBM81348
Synonyms:
β-Lapachone (A3) R115 (Reactive Blue 2) | beta-Lapachone
Type:
Small organic molecule
Emp. Form.:
C15H14O3
Mol. Mass.:
242.2699
SMILES:
CC1(C)CCC2=C(O1)c1ccccc1C(=O)C2=O
: