Target
60 kDa heat shock protein, mitochondrial
Ligand
BDBM80992
Substrate
Meas. Tech.
ChEMBL_1891106 (CHEMBL4392933)
IC50
6000±n/a nM
Citation
 Stevens, MAbdeen, SSalim, NRay, AMWashburn, AChitre, SSivinski, JPark, YHoang, QQChapman, EJohnson, SM HSP60/10 chaperonin systems are inhibited by a variety of approved drugs, natural products, and known bioactive molecules. Bioorg Med Chem Lett 29:1106-1112 (2019)  
Target
Name:
60 kDa heat shock protein, mitochondrial
Synonyms:
3.6.4.9 60 kDa heat shock protein, mitochondrial CPN60 HSP-60 HSP60/HSP10 Heat shock protein 60 Mitochondrial matrix protein P1 | P60 lymphocyte protein
Type:
PROTEIN
Mol. Mass.:
61050.41
Organism:
Homo sapiens
Description:
ChEMBL_117701
Residue:
573
  
Inhibitor
Name:
BDBM80992
Synonyms:
1-cetylpyridin-1-ium;bromide CETYLPYRIDINIUM BROMIDE MLS002695907 cid_8816
Type:
Small organic molecule
Emp. Form.:
C21H38N
Mol. Mass.:
304.5326
SMILES:
CCCCCCCCCCCCCCCC[n+]1ccccc1
: