Target
Thiosulfate sulfurtransferase
Ligand
BDBM25769
Substrate
Meas. Tech.
ChEMBL_1891102 (CHEMBL4392929)
IC50
>100000±n/a nM
Citation
 Stevens, MAbdeen, SSalim, NRay, AMWashburn, AChitre, SSivinski, JPark, YHoang, QQChapman, EJohnson, SM HSP60/10 chaperonin systems are inhibited by a variety of approved drugs, natural products, and known bioactive molecules. Bioorg Med Chem Lett 29:1106-1112 (2019)  
Target
Name:
Thiosulfate sulfurtransferase
Synonyms:
2.8.1.1 THTR_HUMAN Thiosulfate sulfurtransferase
Type:
PROTEIN
Mol. Mass.:
33432.06
Organism:
Homo sapiens
Description:
ChEMBL_118080
Residue:
297
  
Inhibitor
Name:
BDBM25769
Synonyms:
4-[2-(tert-butylamino)-1-hydroxyethyl]-2-(hydroxymethyl)phenol Proventil Salbutamol,(+/-) | albuterol
Type:
Small organic molecule
Emp. Form.:
C13H21NO3
Mol. Mass.:
239.3107
SMILES:
CC(C)(C)NCC(O)c1ccc(O)c(CO)c1
: