Target
Integrin alpha-IIb/beta-3
Ligand
BDBM50078703
Substrate
Meas. Tech.
ChEBML_218228
Ki
28000±n/a nM
Citation
 Keenan, RMMiller, WHBarton, LSBondinell, WECousins, RDEppley, DFHwang, SMKwon, CLago, MANguyen, TTSmith, BRUzinskas, INYuan, CC Orally bioavailable nonpeptide vitronectin receptor antagonists containing 2-aminopyridine arginine mimetics. Bioorg Med Chem Lett 9:1801-6 (1999)  
Target
Name:
Integrin alpha-IIb/beta-3
Synonyms:
Glycoprotein IIb/IIIa
Type:
Mol. Mass.:
Description:
ASSAY_ID of EBI is 30109
Components:
This complex has 2 components.
Component 1
Name:
Integrin beta-3
Synonyms:
CD_antigen=CD61 GPIIIa ITGB3 Platelet membrane glycoprotein IIIa
Type:
Protein
Mol. Mass.:
87038.91
Organism:
Homo sapiens (Human)
Description:
P05106
Residue:
788
  
Component 2
Name:
Integrin alpha-IIb
Synonyms:
CD_antigen=CD41 GPIIb Glycoprotein IIb ITGA2B Integrin alpha-IIb heavy chain Integrin alpha-IIb light chain, form 2 Integrin alpha-V/beta-3 and alpha-IIb/beta 3 | Platelet membrane glycoprotein IIb
Type:
Protein
Mol. Mass.:
113354.85
Organism:
Homo sapiens (Human)
Description:
P08514
Residue:
1039
  
Inhibitor
Name:
BDBM50078703
Synonyms:
CHEMBL301760 | {(S)-4-Methyl-3-oxo-7-[2-(pyridin-2-ylamino)-ethylcarbamoyl]-2,3,4,5-tetrahydro-1H-benzo[e][1,4]diazepin-2-yl}-acetic acid
Type:
Small organic molecule
Emp. Form.:
C20H23N5O4
Mol. Mass.:
397.4277
SMILES:
CN1Cc2cc(ccc2N[C@@H](CC(O)=O)C1=O)C(=O)NCCNc1ccccn1
: