Target
Integrin alpha-V/beta-3
Ligand
BDBM50078714
Substrate
Meas. Tech.
ChEBML_214764
Ki
4±n/a nM
Citation
 Miller, WHBondinell, WECousins, RDErhard, KFJakas, DRKeenan, RMKu, TWNewlander, KARoss, STHaltiwanger, RCBradbeer, JDrake, FHGowen, MHoffman, SJHwang, SMJames, IELark, MWLechowska, BRieman, DJStroup, GBVasko-Moser, JAZembryki, DLAzzarano, LMAdams, PCHuffman, WF Orally bioavailable nonpeptide vitronectin receptor antagonists with efficacy in an osteoporosis model. Bioorg Med Chem Lett 9:1807-12 (1999)  
Target
Name:
Integrin alpha-V/beta-3
Synonyms:
ITGAV/ITGB3 | Integrin beta-3/Vitronectin receptor alpha
Type:
Enzyme
Mol. Mass.:
Description:
Components:
This complex has 2 components.
Component 1
Name:
Integrin alpha-V
Synonyms:
ITAV_HUMAN Integrin alpha-V/alpha-5 VNRA Vitronectin receptor | Vitronectin receptor subunit alpha
Type:
PROTEIN
Mol. Mass.:
116024.92
Organism:
Homo sapiens (Human)
Description:
ChEMBL_582336
Residue:
1048
  
Component 2
Name:
Integrin beta-3
Synonyms:
CD_antigen=CD61 GPIIIa ITGB3 Platelet membrane glycoprotein IIIa
Type:
Protein
Mol. Mass.:
87038.91
Organism:
Homo sapiens (Human)
Description:
P05106
Residue:
788
  
Inhibitor
Name:
BDBM50078714
Synonyms:
CHEMBL288493 {(S)-3-[3-(Pyridin-2-ylamino)-propoxy]-10,11-dihydro-5H-dibenzo[a,d]cyclohepten-10-yl}-acetic acid | {3-[3-(Pyridin-2-ylamino)-propoxy]-10,11-dihydro-5H-dibenzo[a,d]cyclohepten-10-yl}-acetic acid
Type:
Small organic molecule
Emp. Form.:
C25H26N2O3
Mol. Mass.:
402.4855
SMILES:
OC(=O)C[C@@H]1Cc2ccc(OCCCNc3ccccn3)cc2Cc2ccccc12
: