Target
Protein farnesyltransferase subunit beta/geranylgeranyltransferase type-1 subunit alpha
Ligand
BDBM50078819
Substrate
Meas. Tech.
ChEBML_70444
IC50
3.6±n/a nM
Citation
 Afonso, AKelly, JWeinstein, JJames, LBishop, WR Analogs of 4-(3-bromo-8-methyl-10-methoxy-6,11-dihydro-5H-benzo[5,6]-cyclo hepta[1,2-b]pyridin-11-yl)-1-(4-pyridinylacetyl)piperidine N-oxide as inhibitors of farnesyl protein transferase. Bioorg Med Chem Lett 9:1875-80 (1999)  
Target
Name:
Protein farnesyltransferase subunit beta/geranylgeranyltransferase type-1 subunit alpha
Synonyms:
Farnesyltransferase (FTase) Protein Farnesyltransferase (PFT) Chain B | Protein farnesyltransferase
Type:
Protein Complex
Mol. Mass.:
Description:
To express recombinant enzyme in E. coli, the cloned human alpha and beta subunits were co-expressed from a plasmid, in which their expression was translationally coupled.
Components:
This complex has 2 components.
Component 1
Name:
Protein farnesyltransferase subunit beta
Synonyms:
CAAX farnesyltransferase subunit alpha FNTB FTase-alpha GGTase-I-alpha Protein farnesyl/geranylgeranyl transferase Protein farnesyltransferase subunit beta Protein farnesyltransferase/geranylgeranyltransferase type-1 subunit alpha Ras proteins prenyltransferase subunit beta | Type I protein geranyl-geranyltransferase subunit alpha
Type:
Enzyme Subunit
Mol. Mass.:
48766.02
Organism:
Homo sapiens (Human)
Description:
Protein farnesyltransferase subunit beta
Residue:
437
  
Component 2
Name:
Protein farnesyltransferase/geranylgeranyltransferase type-1 subunit alpha
Synonyms:
CAAX farnesyltransferase alpha subunit FNTA_HUMAN FTase-alpha Geranylgeranyl Transferase (GGTase-I) Chain A Protein Farnesyltransferase (PFT) Chain A Protein farnesyltransferase Protein farnesyltransferase/geranylgeranyltransferase type I alpha subunit | Ras proteins prenyltransferase alpha
Type:
Enzyme
Mol. Mass.:
44392.46
Organism:
Homo sapiens (Human)
Description:
Recombinant human FTase.
Residue:
379
  
Inhibitor
Name:
BDBM50078819
Synonyms:
1-[4-((R)-3-Bromo-10-methoxy-8-methyl-6,11-dihydro-5H-benzo[5,6]cyclohepta[1,2-b]pyridin-11-yl)-piperidin-1-yl]-2-(1-oxy-pyridin-4-yl)-ethanone | CHEMBL56774
Type:
Small organic molecule
Emp. Form.:
C28H30BrN3O3
Mol. Mass.:
536.46
SMILES:
COc1cc(C)cc2CCc3cc(Br)cnc3[C@H](C3CCN(CC3)C(=O)Cc3cc[n+]([O-])cc3)c12
: