Target
Matrix metalloproteinase-14
Ligand
BDBM50078951
Substrate
Meas. Tech.
ChEMBL_106782 (CHEMBL718389)
Ki
40±n/a nM
Citation
 Vassiliou, SMucha, ACuniasse, PGeorgiadis, DLucet-Levannier, KBeau, FKannan, RMurphy, GKnäuper, VRio, MCBasset, PYiotakis, ADive, V Phosphinic pseudo-tripeptides as potent inhibitors of matrix metalloproteinases: a structure-activity study. J Med Chem 42:2610-20 (1999)  
Target
Name:
Matrix metalloproteinase-14
Synonyms:
MMP-14 MMP14 MT-MMP 1 MT1MMP Matrix Metalloproteinase-14 (MMP-14) Matrix metalloproteinase-14 Membrane-type matrix metalloproteinase 1 | Membrane-type-1 matrix metalloproteinase
Type:
Protein
Mol. Mass.:
65900.19
Organism:
Homo sapiens (Human)
Description:
P50281
Residue:
582
  
Inhibitor
Name:
BDBM50078951
Synonyms:
CHEMBL87159 | [1-(2-Benzyloxy-acetylamino)-2-phenyl-ethyl]-{2-[1-carbamoyl-2-(1H-indol-3-yl)-ethylcarbamoyl]-5-phenyl-pentyl}-phosphinic acid
Type:
Small organic molecule
Emp. Form.:
C40H45N4O6P
Mol. Mass.:
708.7823
SMILES:
NC(=O)C(Cc1c[nH]c2ccccc12)NC(=O)C(CCCc1ccccc1)CP(O)(=O)C(Cc1ccccc1)NC(=O)COCc1ccccc1
: