Target
Matrix metalloproteinase-14
Ligand
BDBM50078954
Substrate
Meas. Tech.
ChEMBL_106782 (CHEMBL718389)
Ki
92±n/a nM
Citation
 Vassiliou, SMucha, ACuniasse, PGeorgiadis, DLucet-Levannier, KBeau, FKannan, RMurphy, GKnäuper, VRio, MCBasset, PYiotakis, ADive, V Phosphinic pseudo-tripeptides as potent inhibitors of matrix metalloproteinases: a structure-activity study. J Med Chem 42:2610-20 (1999)  
Target
Name:
Matrix metalloproteinase-14
Synonyms:
MMP-14 MMP14 MT-MMP 1 MT1MMP Matrix Metalloproteinase-14 (MMP-14) Matrix metalloproteinase-14 Membrane-type matrix metalloproteinase 1 | Membrane-type-1 matrix metalloproteinase
Type:
Protein
Mol. Mass.:
65900.19
Organism:
Homo sapiens (Human)
Description:
P50281
Residue:
582
  
Inhibitor
Name:
BDBM50078954
Synonyms:
(1-Benzyloxycarbonylamino-ethyl)-{2-[1-carbamoyl-2-(1H-indol-3-yl)-ethylcarbamoyl]-5-phenyl-pentyl}-phosphinic acid | CHEMBL327617
Type:
Small organic molecule
Emp. Form.:
C33H39N4O6P
Mol. Mass.:
618.6597
SMILES:
CC(NC(=O)OCc1ccccc1)P(O)(=O)CC(CCCc1ccccc1)C(=O)NC(Cc1c[nH]c2ccccc12)C(N)=O
: