Target
Matrix metalloproteinase-9
Ligand
BDBM50078953
Substrate
Meas. Tech.
ChEMBL_105378 (CHEMBL712457)
Ki
70±n/a nM
Citation
 Vassiliou, SMucha, ACuniasse, PGeorgiadis, DLucet-Levannier, KBeau, FKannan, RMurphy, GKnäuper, VRio, MCBasset, PYiotakis, ADive, V Phosphinic pseudo-tripeptides as potent inhibitors of matrix metalloproteinases: a structure-activity study. J Med Chem 42:2610-20 (1999)  
Target
Name:
Matrix metalloproteinase-9
Synonyms:
67 kDa matrix metalloproteinase-9 92 kDa gelatinase CLG4B Gelatinase B MMP9 Matrix metalloproteinase 9 (MMP-9) Matrix metalloproteinase-9 (MMP9)
Type:
Enzyme
Mol. Mass.:
78452.28
Organism:
Homo sapiens (Human)
Description:
P14780
Residue:
707
  
Inhibitor
Name:
BDBM50078953
Synonyms:
(1-Benzyloxycarbonylamino-2-phenyl-ethyl)-{2-[1-carbamoyl-2-(1H-indol-3-yl)-ethylcarbamoyl]-6-phenyl-hexyl}-phosphinic acid | CHEMBL327641
Type:
Small organic molecule
Emp. Form.:
C40H45N4O6P
Mol. Mass.:
708.7823
SMILES:
NC(=O)C(Cc1c[nH]c2ccccc12)NC(=O)C(CCCCc1ccccc1)CP(O)(=O)C(Cc1ccccc1)NC(=O)OCc1ccccc1
: