Target
Stromelysin-3
Ligand
BDBM50078935
Substrate
Meas. Tech.
ChEMBL_106454 (CHEMBL716816)
Ki
0.900000±n/a nM
Citation
 Vassiliou, SMucha, ACuniasse, PGeorgiadis, DLucet-Levannier, KBeau, FKannan, RMurphy, GKnäuper, VRio, MCBasset, PYiotakis, ADive, V Phosphinic pseudo-tripeptides as potent inhibitors of matrix metalloproteinases: a structure-activity study. J Med Chem 42:2610-20 (1999)  
Target
Name:
Stromelysin-3
Synonyms:
MMP11_MOUSE Mmp11
Type:
PROTEIN
Mol. Mass.:
55452.62
Organism:
Mus musculus
Description:
ChEMBL_106453
Residue:
492
  
Inhibitor
Name:
BDBM50078935
Synonyms:
(2-{N-[1-Carbamoyl-2-(1H-indol-3-yl)-ethyl]-hydrazinocarbonyl}-5-phenyl-pentyl)-{1-[(4,6-dichloro-1H-indole-2-carbonyl)-amino]-2-phenyl-ethyl}-phosphinic acid | CHEMBL89057
Type:
Small organic molecule
Emp. Form.:
C40H41Cl2N6O5P
Mol. Mass.:
787.671
SMILES:
NN(C(Cc1c[nH]c2ccccc12)C(N)=O)C(=O)C(CCCc1ccccc1)CP(O)(=O)C(Cc1ccccc1)NC(=O)c1cc2c(Cl)cc(Cl)cc2[nH]1
: