Target
Neutrophil collagenase
Ligand
BDBM50078950
Substrate
Meas. Tech.
ChEMBL_105814 (CHEMBL717814)
Ki
1.5±n/a nM
Citation
 Vassiliou, SMucha, ACuniasse, PGeorgiadis, DLucet-Levannier, KBeau, FKannan, RMurphy, GKnäuper, VRio, MCBasset, PYiotakis, ADive, V Phosphinic pseudo-tripeptides as potent inhibitors of matrix metalloproteinases: a structure-activity study. J Med Chem 42:2610-20 (1999)  
Target
Name:
Neutrophil collagenase
Synonyms:
CLG1 MMP8 Matrix metalloproteinase-8 PMNL collagenase | PMNL-CL
Type:
Enzyme
Mol. Mass.:
53413.48
Organism:
Homo sapiens (Human)
Description:
P22894
Residue:
467
  
Inhibitor
Name:
BDBM50078950
Synonyms:
(2-{N-[1-Carbamoyl-2-(1H-indol-3-yl)-ethyl]-hydrazinocarbonyl}-5-phenyl-pentyl)-{1-[(1H-indole-2-carbonyl)-amino]-2-phenyl-ethyl}-phosphinic acid | CHEMBL313472
Type:
Small organic molecule
Emp. Form.:
C40H43N6O5P
Mol. Mass.:
718.7804
SMILES:
NN(C(Cc1c[nH]c2ccccc12)C(N)=O)C(=O)C(CCCc1ccccc1)CP(O)(=O)C(Cc1ccccc1)NC(=O)c1cc2ccccc2[nH]1
: