Target
D(4) dopamine receptor
Ligand
BDBM50079167
Substrate
Meas. Tech.
ChEMBL_60658 (CHEMBL671695)
Ki
4.5±n/a nM
Citation
 Carling, RWMoore, KWMoyes, CRJones, EABonner, KEmms, FMarwood, RPatel, SPatel, SFletcher, AEBeer, MSohal, BPike, ALeeson, PD 1-(3-Cyanobenzylpiperidin-4-yl)-5-methyl-4-phenyl-1, 3-dihydroimidazol-2-one: a selective high-affinity antagonist for the human dopamine D(4) receptor with excellent selectivity over ion channels. J Med Chem 42:2706-15 (1999)  
Target
Name:
D(4) dopamine receptor
Synonyms:
D(2C) dopamine receptor DOPAMINE D4.2 DRD4 Dopamine D4 receptor
Type:
Enzyme
Mol. Mass.:
48373.19
Organism:
Homo sapiens (Human)
Description:
P21917
Residue:
419
  
Inhibitor
Name:
BDBM50079167
Synonyms:
1-(1-Benzyl-piperidin-4-yl)-5-methyl-4-pyridin-2-yl-1,3-dihydro-imidazol-2-one | CHEMBL91553
Type:
Small organic molecule
Emp. Form.:
C21H24N4O
Mol. Mass.:
348.4415
SMILES:
Cc1c([nH]c(=O)n1C1CCN(Cc2ccccc2)CC1)-c1ccccn1
: