Target
D(4) dopamine receptor
Ligand
BDBM50079171
Substrate
Meas. Tech.
ChEMBL_60658 (CHEMBL671695)
Ki
0.96±n/a nM
Citation
 Carling, RWMoore, KWMoyes, CRJones, EABonner, KEmms, FMarwood, RPatel, SPatel, SFletcher, AEBeer, MSohal, BPike, ALeeson, PD 1-(3-Cyanobenzylpiperidin-4-yl)-5-methyl-4-phenyl-1, 3-dihydroimidazol-2-one: a selective high-affinity antagonist for the human dopamine D(4) receptor with excellent selectivity over ion channels. J Med Chem 42:2706-15 (1999)  
Target
Name:
D(4) dopamine receptor
Synonyms:
D(2C) dopamine receptor DOPAMINE D4.2 DRD4 Dopamine D4 receptor
Type:
Enzyme
Mol. Mass.:
48373.19
Organism:
Homo sapiens (Human)
Description:
P21917
Residue:
419
  
Inhibitor
Name:
BDBM50079171
Synonyms:
3-[4-(5-Methyl-2-oxo-4-phenyl-2,3-dihydro-imidazol-1-yl)-piperidin-1-ylmethyl]-benzonitrile | CHEMBL431095
Type:
Small organic molecule
Emp. Form.:
C23H24N4O
Mol. Mass.:
372.4629
SMILES:
Cc1c([nH]c(=O)n1C1CCN(Cc2cccc(c2)C#N)CC1)-c1ccccc1
: