Target
D(2) dopamine receptor
Ligand
BDBM50443101
Substrate
Meas. Tech.
ChEMBL_1892552 (CHEMBL4394473)
EC50
0.400000±n/a nM
Citation
 Shen, YMcCorvy, JDMartini, MLRodriguiz, RMPogorelov, VMWard, KMWetsel, WCLiu, JRoth, BLJin, J D J Med Chem 62:4755-4771 (2019)  
Target
Name:
D(2) dopamine receptor
Synonyms:
D(2) dopamine receptor DOPAMINE D2 Long DRD2 Dopamine D2 receptor Dopamine D2 receptor (D2R) Dopamine2-like | d2
Type:
Cell-surface receptors
Mol. Mass.:
50647.10
Organism:
Homo sapiens (Human)
Description:
P14416
Residue:
443
  
Inhibitor
Name:
BDBM50443101
Synonyms:
Cariprazine | RGH-188
Type:
Small organic molecule
Emp. Form.:
C21H32Cl2N4O
Mol. Mass.:
427.411
SMILES:
CN(C)C(=O)N[C@H]1CC[C@H](CCN2CCN(CC2)c2cccc(Cl)c2Cl)CC1
: