Target
Cyclin-dependent kinase 1
Ligand
BDBM7585
Substrate
Meas. Tech.
ChEMBL_50351 (CHEMBL662511)
IC50
650±n/a nM
Citation
 Schultz, CLink, ALeost, MZaharevitz, DWGussio, RSausville, EAMeijer, LKunick, C Paullones, a series of cyclin-dependent kinase inhibitors: synthesis, evaluation of CDK1/cyclin B inhibition, and in vitro antitumor activity. J Med Chem 42:2909-19 (1999)  
Target
Name:
Cyclin-dependent kinase 1
Synonyms:
CDC2 CDK1 CDKN1 Cell division protein kinase 1 P34CDC2 | p34 protein kinase
Type:
Enzyme Subunit
Mol. Mass.:
34101.08
Organism:
Homo sapiens (Human)
Description:
P06493
Residue:
297
  
Inhibitor
Name:
BDBM7585
Synonyms:
(R,S)-Roscovitine 2-{[6-(benzylamino)-9-(propan-2-yl)-9H-purin-2-yl]amino}butan-1-ol US10294218, Example Roscovitine | US9617225, Roscovitine
Type:
Small organic molecule
Emp. Form.:
C19H26N6O
Mol. Mass.:
354.4493
SMILES:
CCC(CO)Nc1nc(NCc2ccccc2)c2ncn(C(C)C)c2n1
: