Target
Endothelin-1 receptor
Ligand
BDBM50079429
Substrate
Meas. Tech.
ChEMBL_65646 (CHEMBL678558)
Ki
2.37±n/a nM
Citation
 Amberg, WHergenröder, SHillen, HJansen, RKettschau, GKling, AKlinge, DRaschack, MRiechers, HUnger, L Discovery and synthesis of (S)-3-[2-(3,4-dimethoxyphenyl)ethoxy]-2- (4,6-dimethylpyrimidin-2-yloxy)-3,3-diphenylpropionic acid (LU 302872), a novel orally active mixed ET(A)/ET(B) receptor antagonist. J Med Chem 42:3026-32 (1999)  
Target
Name:
Endothelin-1 receptor
Synonyms:
EDNRA ET-A ETA-R Endothelin receptor type A hET-AR
Type:
Enzyme Catalytic Domain
Mol. Mass.:
48736.88
Organism:
Homo sapiens (Human)
Description:
P25101
Residue:
427
  
Inhibitor
Name:
BDBM50079429
Synonyms:
3-[2-(3,4-Dimethoxy-phenyl)-ethoxy]-2-(4-methoxy-6-methyl-pyrimidin-2-yloxy)-3,3-diphenyl-propionic acid | CHEMBL319031
Type:
Small organic molecule
Emp. Form.:
C31H32N2O7
Mol. Mass.:
544.595
SMILES:
COc1cc(C)nc(OC(C(O)=O)C(OCCc2ccc(OC)c(OC)c2)(c2ccccc2)c2ccccc2)n1
: