Target
Endothelin receptor type B
Ligand
BDBM50079426
Substrate
Meas. Tech.
ChEMBL_63846 (CHEMBL673230)
Ki
3.21±n/a nM
Citation
 Amberg, WHergenröder, SHillen, HJansen, RKettschau, GKling, AKlinge, DRaschack, MRiechers, HUnger, L Discovery and synthesis of (S)-3-[2-(3,4-dimethoxyphenyl)ethoxy]-2- (4,6-dimethylpyrimidin-2-yloxy)-3,3-diphenylpropionic acid (LU 302872), a novel orally active mixed ET(A)/ET(B) receptor antagonist. J Med Chem 42:3026-32 (1999)  
Target
Name:
Endothelin receptor type B
Synonyms:
EDNRB ENDOTHELIN B ETRB Endothelin receptor non-selective type | Endothelin receptor, ET-A/ET-B
Type:
Enzyme Catalytic Domain
Mol. Mass.:
49664.00
Organism:
Homo sapiens (Human)
Description:
ENDOTHELIN B EDNRB HUMAN::P24530
Residue:
442
  
Inhibitor
Name:
BDBM50079426
Synonyms:
2-(4,6-Dimethyl-pyrimidin-2-yloxy)-3,3-diphenyl-3-[2-(3,4,5-trimethoxy-phenyl)-ethoxy]-propionic acid | CHEMBL103201
Type:
Small organic molecule
Emp. Form.:
C32H34N2O7
Mol. Mass.:
558.6216
SMILES:
COc1cc(CCOC(C(Oc2nc(C)cc(C)n2)C(O)=O)(c2ccccc2)c2ccccc2)cc(OC)c1OC
: