Target
Endothelin-1 receptor
Ligand
BDBM50079439
Substrate
Meas. Tech.
ChEMBL_65646 (CHEMBL678558)
Ki
1.95±n/a nM
Citation
 Amberg, WHergenröder, SHillen, HJansen, RKettschau, GKling, AKlinge, DRaschack, MRiechers, HUnger, L Discovery and synthesis of (S)-3-[2-(3,4-dimethoxyphenyl)ethoxy]-2- (4,6-dimethylpyrimidin-2-yloxy)-3,3-diphenylpropionic acid (LU 302872), a novel orally active mixed ET(A)/ET(B) receptor antagonist. J Med Chem 42:3026-32 (1999)  
Target
Name:
Endothelin-1 receptor
Synonyms:
EDNRA ET-A ETA-R Endothelin receptor type A hET-AR
Type:
Enzyme Catalytic Domain
Mol. Mass.:
48736.88
Organism:
Homo sapiens (Human)
Description:
P25101
Residue:
427
  
Inhibitor
Name:
BDBM50079439
Synonyms:
2-(4-Methoxy-6-methyl-pyrimidin-2-yloxy)-3-[2-(4-methoxy-phenyl)-ethoxy]-3,3-diphenyl-propionic acid | CHEMBL102307
Type:
Small organic molecule
Emp. Form.:
C30H30N2O6
Mol. Mass.:
514.569
SMILES:
COc1ccc(CCOC(C(Oc2nc(C)cc(OC)n2)C(O)=O)(c2ccccc2)c2ccccc2)cc1
: