Target
Neuronal acetylcholine receptor subunit alpha-4/beta-2
Ligand
BDBM50079454
Substrate
Meas. Tech.
ChEMBL_143879 (CHEMBL751862)
Ki
1.1±n/a nM
Citation
 Schmitt, JDSharples, CGCaldwell, WS Molecular recognition in nicotinic acetylcholine receptors: the importance of pi-cation interactions. J Med Chem 42:3066-74 (1999)  
Target
Name:
Neuronal acetylcholine receptor subunit alpha-4/beta-2
Synonyms:
Neuronal acetylcholine receptor Alpha-4/Beta-2 Neuronal acetylcholine receptor; alpha4/beta2 | nAChR subtypes alpha4 beta2
Type:
Protein
Mol. Mass.:
Description:
Components:
This complex has 2 components.
Component 1
Name:
Neuronal acetylcholine receptor subunit alpha-4
Synonyms:
ACHA4_HUMAN CHRNA4 protein Neuronal acetylcholine receptor protein alpha-4 subunit Nicotinic acetylcholine receptor alpha4/beta2/alpha5
Type:
Mol. Mass.:
69963.49
Organism:
Homo sapiens (Human)
Description:
NACHRA4
Residue:
627
  
Component 2
Name:
Neuronal acetylcholine receptor subunit beta-2
Synonyms:
ACHB2_HUMAN Neuronal acetylcholine receptor protein beta-2 subunit | Nicotinic acetylcholine receptor alpha3/beta2/alpha5
Type:
Protein
Mol. Mass.:
57020.50
Organism:
Homo sapiens (Human)
Description:
P17787
Residue:
502
  
Inhibitor
Name:
BDBM50079454
Synonyms:
3-Azetidin-2-yl-pyridine | CHEMBL323325
Type:
Small organic molecule
Emp. Form.:
C8H10N2
Mol. Mass.:
134.1784
SMILES:
C1CC(N1)c1cccnc1
: