Target
Acetolactate synthase, chloroplastic
Ligand
BDBM50216783
Substrate
Meas. Tech.
ChEBML_27494
IC50
>362000±n/a nM
Comments
modified from >100 20220121
Citation
 Liu, JLi, ZYan, HWang, LChen, J The design and synthesis of ALS inhibitors from pharmacophore models. Bioorg Med Chem Lett 9:1927-32 (1999)  
Target
Name:
Acetolactate synthase, chloroplastic
Synonyms:
AHAS Acetolactate synthase ILVB_ARATH | TZP5
Type:
PROTEIN
Mol. Mass.:
72585.19
Organism:
Arabidopsis thaliana
Description:
ChEMBL_934103
Residue:
670
  
Inhibitor
Name:
BDBM50216783
Synonyms:
CHEMBL293995
Type:
Small organic molecule
Emp. Form.:
C13H12N2O5
Mol. Mass.:
276.2448
SMILES:
COc1ccc(cc1)C(=O)OCn1ccc(=O)[nH]c1=O
: