Target
Beta-lactamase
Ligand
BDBM50079685
Substrate
Meas. Tech.
ChEMBL_41050 (CHEMBL650472)
IC50
708±n/a nM
Citation
 Buynak, JDRao, ASDoppalapudi, VRAdam, GPetersen, PJNidamarthy, SD The synthesis and evaluation of 6-alkylidene-2'beta-substituted penam sulfones as beta-lactamase inhibitors. Bioorg Med Chem Lett 9:1997-2002 (1999)  
Target
Name:
Beta-lactamase
Synonyms:
BLAC_STAAU Penicillinase | blaZ
Type:
PROTEIN
Mol. Mass.:
31367.53
Organism:
Staphylococcus aureus
Description:
ChEMBL_41052
Residue:
281
  
Inhibitor
Name:
BDBM50079685
Synonyms:
CHEMBL61762 | disodium (2S,3R,5R,6Z)-3-[(acetyloxy)methyl]-3-methyl-6-(2-oxido-2-oxoethylidene)-7-oxo-4-thia-1-azabicyclo[3.2.0]heptane-2-carboxylate 4,4-dioxide
Type:
Small organic molecule
Emp. Form.:
C12H11NO9S
Mol. Mass.:
345.283
SMILES:
CC(=O)OC[C@@]1(C)[C@@H](N2C(\C(=C/C([O-])=O)C2=O)S1(=O)=O)C([O-])=O
: