Target
Gag-Pol polyprotein [489-587]
Ligand
BDBM50079709
Substrate
Meas. Tech.
ChEBML_79977
pH
4.7±n/a
IC50
195±n/a nM
Comments
extracted
Citation
 Ellsworth, ELDomagala, JPrasad, JVHagen, SFerguson, DHoller, THupe, DGraham, NNouhan, CTummino, PJZeikus, GLunney, EA 4-hydroxy-5,6-dihydro-2H-pyran-2-ones.3. Bicyclic and hetero-aromatic ring systems as 3-position scaffolds to bind to S1' and S2' of the HIV-1 protease enzyme. Bioorg Med Chem Lett 9:2019-24 (1999)  
Target
Name:
Gag-Pol polyprotein [489-587]
Synonyms:
Human immunodeficiency virus type 1 protease Pol polyprotein | gag-pol
Type:
Enzyme Subunit
Mol. Mass.:
10781.16
Organism:
Human immunodeficiency virus type 1
Description:
P04585[489-587]
Residue:
99
  
Inhibitor
Name:
BDBM50079709
Synonyms:
4-Hydroxy-3-(3-methyl-thiophen-2-ylsulfanyl)-6-phenethyl-6-phenyl-5,6-dihydro-pyran-2-one | CHEMBL62390
Type:
Small organic molecule
Emp. Form.:
C24H22O3S2
Mol. Mass.:
422.56
SMILES:
Cc1ccsc1SC1C(=O)CC(CCc2ccccc2)(OC1=O)c1ccccc1
: