Target
Imidazoleglycerol-phosphate dehydratase
Ligand
BDBM50079723
Substrate
Meas. Tech.
ChEBML_90659
Ki
230±n/a nM
Citation
 Schweitzer, BALoida, PJThompson-Mize, RLCaJacob, CAHegde, SG Design and synthesis of beta-carboxamido phosphonates as potent inhibitors of imidazole glycerol phosphate dehydratase. Bioorg Med Chem Lett 9:2053-8 (1999)  
Target
Name:
Imidazoleglycerol-phosphate dehydratase
Synonyms:
HIS3 IGPD
Type:
PROTEIN
Mol. Mass.:
21976.83
Organism:
Cryptococcus neoformans
Description:
ChEMBL_90660
Residue:
202
  
Inhibitor
Name:
BDBM50079723
Synonyms:
CHEMBL418642 | [2-(2-Phenoxy-propionylamino)-3-[1,2,4]triazol-1-yl-propyl]-phosphonic acid
Type:
Small organic molecule
Emp. Form.:
C14H19N4O5P
Mol. Mass.:
354.2982
SMILES:
CC(Oc1ccccc1)C(=O)NC(Cn1cncn1)CP(O)(O)=O
: