Target
Imidazoleglycerol-phosphate dehydratase
Ligand
BDBM50079719
Substrate
Meas. Tech.
ChEMBL_90660 (CHEMBL700891)
Ki
560±n/a nM
Citation
 Schweitzer, BALoida, PJThompson-Mize, RLCaJacob, CAHegde, SG Design and synthesis of beta-carboxamido phosphonates as potent inhibitors of imidazole glycerol phosphate dehydratase. Bioorg Med Chem Lett 9:2053-8 (1999)  
Target
Name:
Imidazoleglycerol-phosphate dehydratase
Synonyms:
HIS3 IGPD
Type:
PROTEIN
Mol. Mass.:
21976.83
Organism:
Cryptococcus neoformans
Description:
ChEMBL_90660
Residue:
202
  
Inhibitor
Name:
BDBM50079719
Synonyms:
CHEMBL63147 | [2-(2-Thiophen-2-yl-acetylamino)-3-[1,2,4]triazol-1-yl-propyl]-phosphonic acid
Type:
Small organic molecule
Emp. Form.:
C11H15N4O4PS
Mol. Mass.:
330.3
SMILES:
OP(O)(=O)CC(Cn1cncn1)NC(=O)Cc1cccs1
: