Target
Imidazoleglycerol-phosphate dehydratase
Ligand
BDBM50079728
Substrate
Meas. Tech.
ChEMBL_90659 (CHEMBL700890)
IC50
2000±n/a nM
Citation
 Schweitzer, BALoida, PJThompson-Mize, RLCaJacob, CAHegde, SG Design and synthesis of beta-carboxamido phosphonates as potent inhibitors of imidazole glycerol phosphate dehydratase. Bioorg Med Chem Lett 9:2053-8 (1999)  
Target
Name:
Imidazoleglycerol-phosphate dehydratase
Synonyms:
HIS3 IGPD
Type:
PROTEIN
Mol. Mass.:
21976.83
Organism:
Cryptococcus neoformans
Description:
ChEMBL_90660
Residue:
202
  
Inhibitor
Name:
BDBM50079728
Synonyms:
CHEMBL304038 | {2-[2-(4-Chloro-phenoxy)-acetylamino]-3-[1,2,4]triazol-1-yl-propyl}-phosphonic acid
Type:
Small organic molecule
Emp. Form.:
C13H16ClN4O5P
Mol. Mass.:
374.717
SMILES:
OP(O)(=O)CC(Cn1cncn1)NC(=O)COc1ccc(Cl)cc1
: