Target
Proteinase-activated receptor 1
Ligand
BDBM50079753
Substrate
Meas. Tech.
ChEBML_209264
IC50
870±n/a nM
Citation
 Ahn, HSArik, LBoykow, GBurnett, DACaplen, MACzarniecki, MDomalski, MSFoster, CManna, MStamford, AWWu, Y Structure-activity relationships of pyrroloquinazolines as thrombin receptor antagonists. Bioorg Med Chem Lett 9:2073-8 (1999)  
Target
Name:
Proteinase-activated receptor 1
Synonyms:
CF2R F2R PAR1 Proteinase activated receptor 1 TR Thrombin receptor/ Proteinase-activated receptor 1(Par-1)
Type:
Protein
Mol. Mass.:
47450.07
Organism:
Homo sapiens (Human)
Description:
P25116
Residue:
425
  
Inhibitor
Name:
BDBM50079753
Synonyms:
7-(4-Isopropyl-benzyl)-N*3*-methyl-7H-pyrrolo[3,2-f]quinazoline-1,3-diamine | CHEMBL305329
Type:
Small organic molecule
Emp. Form.:
C21H23N5
Mol. Mass.:
345.4408
SMILES:
CNc1nc(N)c2c3ccn(Cc4ccc(cc4)C(C)C)c3ccc2n1
: