Target
Proteinase-activated receptor 1
Ligand
BDBM50079758
Substrate
Meas. Tech.
ChEBML_209264
IC50
1750±n/a nM
Citation
 Ahn, HSArik, LBoykow, GBurnett, DACaplen, MACzarniecki, MDomalski, MSFoster, CManna, MStamford, AWWu, Y Structure-activity relationships of pyrroloquinazolines as thrombin receptor antagonists. Bioorg Med Chem Lett 9:2073-8 (1999)  
Target
Name:
Proteinase-activated receptor 1
Synonyms:
CF2R F2R PAR1 Proteinase activated receptor 1 TR Thrombin receptor/ Proteinase-activated receptor 1(Par-1)
Type:
Protein
Mol. Mass.:
47450.07
Organism:
Homo sapiens (Human)
Description:
P25116
Residue:
425
  
Inhibitor
Name:
BDBM50079758
Synonyms:
7-(6-Methyl-naphthalen-2-ylmethyl)-7H-pyrrolo[3,2-f]quinazoline-1,3-diamine | CHEMBL63192
Type:
Small organic molecule
Emp. Form.:
C22H19N5
Mol. Mass.:
353.4198
SMILES:
Cc1ccc2cc(Cn3ccc4c3ccc3nc(N)nc(N)c43)ccc2c1
: