Target
Proteinase-activated receptor 1
Ligand
BDBM50079761
Substrate
Meas. Tech.
ChEBML_209264
IC50
4900±n/a nM
Citation
 Ahn, HSArik, LBoykow, GBurnett, DACaplen, MACzarniecki, MDomalski, MSFoster, CManna, MStamford, AWWu, Y Structure-activity relationships of pyrroloquinazolines as thrombin receptor antagonists. Bioorg Med Chem Lett 9:2073-8 (1999)  
Target
Name:
Proteinase-activated receptor 1
Synonyms:
CF2R F2R PAR1 Proteinase activated receptor 1 TR Thrombin receptor/ Proteinase-activated receptor 1(Par-1)
Type:
Protein
Mol. Mass.:
47450.07
Organism:
Homo sapiens (Human)
Description:
P25116
Residue:
425
  
Inhibitor
Name:
BDBM50079761
Synonyms:
2-[1-Amino-7-(4-isopropyl-benzyl)-7H-pyrrolo[3,2-f]quinazolin-3-ylamino]-ethanol | CHEMBL302226
Type:
Small organic molecule
Emp. Form.:
C22H25N5O
Mol. Mass.:
375.4668
SMILES:
CC(C)c1ccc(Cn2ccc3c2ccc2nc(NCCO)nc(N)c32)cc1
: