Target
H2-K region expressed gene 2, rat orthologue
Ligand
BDBM50079832
Substrate
Meas. Tech.
ChEBML_103872
IC50
>50000±n/a nM
Citation
 Jones, ABActon, JJRivetna, MNCummings, RTCubbon, RMNichols, EASchwartz, CDWicker, LSHermes, JD Tetrapeptide derived inhibitors of complexation of a class II MHC: the peptide backbone is not inviolate. Bioorg Med Chem Lett 9:2109-14 (1999)  
Target
Name:
H2-K region expressed gene 2, rat orthologue
Synonyms:
MHC class II | MHC class II region expressed gene KE2, isoform CRA_a
Type:
PROTEIN
Mol. Mass.:
14499.39
Organism:
Rattus norvegicus
Description:
ChEMBL_10342
Residue:
127
  
Inhibitor
Name:
BDBM50079832
Synonyms:
(S)-N-{(R)-1-[(S)-1-((S)-1-Carbamoyl-3-methyl-butylcarbamoyl)-butyl]-2-oxo-pyrrolidin-3-yl}-2-cyclohexylmethyl-malonamic acid ethyl ester | CHEMBL63337
Type:
Small organic molecule
Emp. Form.:
C27H46N4O6
Mol. Mass.:
522.6773
SMILES:
CCC[C@H](N1CC[C@@H](NC(=O)[C@H](CC2CCCCC2)C(=O)OCC)C1=O)C(=O)N[C@@H](CC(C)C)C(N)=O
: