Target
H2-K region expressed gene 2, rat orthologue
Ligand
BDBM50079843
Substrate
Meas. Tech.
ChEMBL_103873 (CHEMBL712990)
IC50
4700±n/a nM
Citation
 Jones, ABActon, JJAdams, ADYuen, WNichols, EASchwartz, CDWicker, LSHermes, JD Tetrapeptide derived inhibitors of complexation of a class II MHC: fully unnatural ligands. Bioorg Med Chem Lett 9:2115-8 (1999)  
Target
Name:
H2-K region expressed gene 2, rat orthologue
Synonyms:
MHC class II | MHC class II region expressed gene KE2, isoform CRA_a
Type:
PROTEIN
Mol. Mass.:
14499.39
Organism:
Rattus norvegicus
Description:
ChEMBL_10342
Residue:
127
  
Inhibitor
Name:
BDBM50079843
Synonyms:
CHEMBL68009 | N'-{(S)-2-[(R)-3-(3-Cyclohexyl-propylamino)-2-oxo-pyrrolidin-1-yl]-pentanoyl}-N-isobutyl-hydrazinecarboxylic acid ethyl ester
Type:
Small organic molecule
Emp. Form.:
C25H46N4O4
Mol. Mass.:
466.6571
SMILES:
CCC[C@H](N1CC[C@@H](NCCCC2CCCCC2)C1=O)C(=O)NN(CC(C)C)C(=O)OCC
: