Target
Phenylethanolamine N-methyltransferase
Ligand
BDBM13023
Substrate
Meas. Tech.
ChEMBL_152400 (CHEMBL764116)
Ki
340±n/a nM
Citation
 Grunewald, GLCaldwell, TMLi, QCriscione, KR Synthesis and evaluation of 3-trifluoromethyl-7-substituted-1,2,3, 4-tetrahydroisoquinolines as selective inhibitors of phenylethanolamine N-methyltransferase versus the alpha(2)-adrenoceptor. J Med Chem 42:3315-23 (1999)  
Target
Name:
Phenylethanolamine N-methyltransferase
Synonyms:
Noradrenaline N-methyltransferase PNMT_BOVIN | PNMTase
Type:
Enzyme
Mol. Mass.:
30916.97
Organism:
Bos taurus (bovine)
Description:
Residue:
283
  
Inhibitor
Name:
BDBM13023
Synonyms:
3-(hydroxymethyl)-1,2,3,4-tetrahydroisoquinoline-7-sulfonamide CHEMBL41647
Type:
Small organic molecule
Emp. Form.:
C10H14N2O3S
Mol. Mass.:
242.295
SMILES:
NS(=O)(=O)c1ccc2CC(CO)NCc2c1
: