Target
Cannabinoid receptor 2
Ligand
BDBM50080030
Substrate
Meas. Tech.
ChEMBL_46999 (CHEMBL658968)
Ki
0.39±n/a nM
Citation
 Khanolkar, ADLu, DFan, PTian, XMakriyannis, A Novel conformationally restricted tetracyclic analogs of delta8-tetrahydrocannabinol. Bioorg Med Chem Lett 9:2119-24 (1999)  
Target
Name:
Cannabinoid receptor 2
Synonyms:
CANNABINOID CB2 CB2 Cannabinoid CB2 receptor Cannabinoid receptor 2 mCB2
Type:
Enzyme Catalytic Domain
Mol. Mass.:
38220.43
Organism:
MOUSE
Description:
P47936
Residue:
347
  
Inhibitor
Name:
BDBM50080030
Synonyms:
(6aR,10aR)-3-Heptyl-6,6,9-trimethyl-6a,7,10,10a-tetrahydro-6H-benzo[c]chromen-1-ol 3-Heptyl-6,6,9-trimethyl-6a,7,10,10a-tetrahydro-6H-benzo[c]chromen-1-ol | CHEMBL67464
Type:
Small organic molecule
Emp. Form.:
C23H34O2
Mol. Mass.:
342.5149
SMILES:
CCCCCCCc1cc(O)c2[C@@H]3CC(C)=CC[C@H]3C(C)(C)Oc2c1
: