Target
Gag-Pol polyprotein [489-587]
Ligand
BDBM50073223
Substrate
Meas. Tech.
ChEMBL_157695 (CHEMBL763872)
Ki
<0.010000±n/a nM
Citation
 Kaltenbach, RFKlabe, RMCordova, BCSeitz, SP Increased antiviral activity of cyclic urea HIV protease inhibitors by modifying the P1/P1' substituents. Bioorg Med Chem Lett 9:2259-62 (1999)  
Target
Name:
Gag-Pol polyprotein [489-587]
Synonyms:
Human immunodeficiency virus type 1 protease Pol polyprotein | gag-pol
Type:
Enzyme Subunit
Mol. Mass.:
10781.16
Organism:
Human immunodeficiency virus type 1
Description:
P04585[489-587]
Residue:
99
  
Inhibitor
Name:
BDBM50073223
Synonyms:
CHEMBL73240
Type:
Small organic molecule
Emp. Form.:
C35H36N8O3
Mol. Mass.:
616.7121
SMILES:
Nc1[nH]nc2ccc(CN3[C@H](Cc4ccccc4)[C@H](O)[C@@H](O)[C@@H](Cc4ccccc4)N(Cc4ccc5n[nH]c(N)c5c4)C3=O)cc12
: