Target
DNA topoisomerase 1
Ligand
BDBM50080278
Substrate
Meas. Tech.
ChEBML_53716
IC50
110630±n/a nM
Citation
 Song, GYZheng, XGKim, YYou, YJSok, DEAhn, BZ Naphthazarin derivatives (II): formation of glutathione conjugate, inhibition of DNA topoisomerase-I and cytotoxicity. Bioorg Med Chem Lett 9:2407-12 (1999)  
Target
Name:
DNA topoisomerase 1
Synonyms:
DNA topoisomerase I TOP1 | TOP1_HUMAN
Type:
Enzyme
Mol. Mass.:
90771.02
Organism:
Homo sapiens (Human)
Description:
P11387
Residue:
765
  
Inhibitor
Name:
BDBM50080278
Synonyms:
6-(1-Hydroxy-ethyl)-5,8-dimethoxy-[1,4]naphthoquinone | CHEMBL78344
Type:
Small organic molecule
Emp. Form.:
C14H14O5
Mol. Mass.:
262.258
SMILES:
COc1cc(C(C)O)c(OC)c2C(=O)C=CC(=O)c12
: