Target
Glutaminase kidney isoform, mitochondrial
Ligand
BDBM50525796
Substrate
Meas. Tech.
ChEMBL_1898241 (CHEMBL4400276)
IC50
103±n/a nM
Citation
 McDermott, LKoes, DMohammed, SIyer, PBoby, MBalasubramanian, VGeedy, MKatt, WCerione, R GAC inhibitors with a 4-hydroxypiperidine spacer: Requirements for potency. Bioorg Med Chem Lett 29:0 (2019)  
Target
Name:
Glutaminase kidney isoform, mitochondrial
Synonyms:
GLS GLSK_HUMAN K-glutaminase L-glutamine amidohydrolase
Type:
Protein
Mol. Mass.:
73471.89
Organism:
Homo sapiens (Human)
Description:
O94925
Residue:
669
  
Inhibitor
Name:
BDBM50525796
Synonyms:
CHEMBL4454551
Type:
Small organic molecule
Emp. Form.:
C20H23N7O3S2
Mol. Mass.:
473.572
SMILES:
CCC(=O)Nc1nnc(s1)N1CCC(CC1)Oc1nnc(NC(=O)Cc2ccccc2)s1
: