Target
Glutaminase kidney isoform, mitochondrial
Ligand
BDBM50149992
Substrate
Meas. Tech.
ChEMBL_1898241 (CHEMBL4400276)
IC50
158±n/a nM
Citation
 McDermott, LKoes, DMohammed, SIyer, PBoby, MBalasubramanian, VGeedy, MKatt, WCerione, R GAC inhibitors with a 4-hydroxypiperidine spacer: Requirements for potency. Bioorg Med Chem Lett 29:0 (2019)  
Target
Name:
Glutaminase kidney isoform, mitochondrial
Synonyms:
GLS GLSK_HUMAN K-glutaminase L-glutamine amidohydrolase
Type:
Protein
Mol. Mass.:
73471.89
Organism:
Homo sapiens (Human)
Description:
O94925
Residue:
669
  
Inhibitor
Name:
BDBM50149992
Synonyms:
CHEMBL3769897
Type:
Small organic molecule
Emp. Form.:
C19H25N7O3S2
Mol. Mass.:
463.577
SMILES:
O=C(CC1CC1)Nc1nnc(OC2CCN(CC2)c2nnc(NC(=O)CC3CC3)s2)s1
: