Target
Retinoic acid receptor RXR-beta
Ligand
BDBM50080524
Substrate
Meas. Tech.
ChEBML_197086
EC50
47±n/a nM
Citation
 Dhar, ALiu, SKlucik, JBerlin, KDMadler, MMLu, SIvey, RTZacheis, DBrown, CWNelson, ECBirckbichler, PJBenbrook, DM Synthesis, structure-activity relationships, and RARgamma-ligand interactions of nitrogen heteroarotinoids. J Med Chem 42:3602-14 (1999)  
Target
Name:
Retinoic acid receptor RXR-beta
Synonyms:
Nr2b2 Retinoid X receptor beta | Rxrb
Type:
PROTEIN
Mol. Mass.:
55877.78
Organism:
Mus musculus
Description:
ChEMBL_196588
Residue:
520
  
Inhibitor
Name:
BDBM50080524
Synonyms:
1-Isopropyl-4,4-dimethyl-1,2,3,4-tetrahydro-quinoline-6-carboxylic acid 4-ethoxycarbonyl-phenyl ester | CHEMBL120210
Type:
Small organic molecule
Emp. Form.:
C24H29NO4
Mol. Mass.:
395.4914
SMILES:
CCOC(=O)c1ccc(OC(=O)c2ccc3N(CCC(C)(C)c3c2)C(C)C)cc1
: