Target
Retinoic acid receptor RXR-beta
Ligand
BDBM50080526
Substrate
Meas. Tech.
ChEBML_197086
EC50
33±n/a nM
Citation
 Dhar, ALiu, SKlucik, JBerlin, KDMadler, MMLu, SIvey, RTZacheis, DBrown, CWNelson, ECBirckbichler, PJBenbrook, DM Synthesis, structure-activity relationships, and RARgamma-ligand interactions of nitrogen heteroarotinoids. J Med Chem 42:3602-14 (1999)  
Target
Name:
Retinoic acid receptor RXR-beta
Synonyms:
Nr2b2 Retinoid X receptor beta | Rxrb
Type:
PROTEIN
Mol. Mass.:
55877.78
Organism:
Mus musculus
Description:
ChEMBL_196588
Residue:
520
  
Inhibitor
Name:
BDBM50080526
Synonyms:
1,4,4-Trimethyl-1,2,3,4-tetrahydro-quinoline-6-carboxylic acid 4-ethoxycarbonyl-phenyl ester | CHEMBL422607
Type:
Small organic molecule
Emp. Form.:
C22H25NO4
Mol. Mass.:
367.4382
SMILES:
CCOC(=O)c1ccc(OC(=O)c2ccc3N(C)CCC(C)(C)c3c2)cc1
: