Target
Endothelin receptor type B
Ligand
BDBM50080596
Substrate
Meas. Tech.
ChEMBL_63675 (CHEMBL670478)
IC50
3.8±n/a nM
Citation
 von Geldern, TWTasker, ASSorensen, BKWinn, MSzczepankiewicz, BGDixon, DBChiou, WJWang, LWessale, JLAdler, AMarsh, KCNguyen, BOpgenorth, TJ Pyrrolidine-3-carboxylic acids as endothelin antagonists. 4. Side chain conformational restriction leads to ET(B) selectivity. J Med Chem 42:3668-78 (1999)  
Target
Name:
Endothelin receptor type B
Synonyms:
EDNRB ENDOTHELIN B ETRB Endothelin receptor non-selective type | Endothelin receptor, ET-A/ET-B
Type:
Enzyme Catalytic Domain
Mol. Mass.:
49664.00
Organism:
Homo sapiens (Human)
Description:
ENDOTHELIN B EDNRB HUMAN::P24530
Residue:
442
  
Inhibitor
Name:
BDBM50080596
Synonyms:
(2R,3R,4S)-4-Benzo[1,3]dioxol-5-yl-1-[(2,6-diethyl-phenylcarbamoyl)-methyl]-2-[4-(2-methoxy-ethyl)-phenyl]-pyrrolidine-3-carboxylic acid | CHEMBL331066
Type:
Small organic molecule
Emp. Form.:
C33H38N2O6
Mol. Mass.:
558.6646
SMILES:
CCc1cccc(CC)c1NC(=O)CN1C[C@@H]([C@H]([C@@H]1c1ccc(CCOC)cc1)C(O)=O)c1ccc2OCOc2c1
: