Target
Endothelin receptor type B
Ligand
BDBM50080607
Substrate
Meas. Tech.
ChEMBL_63675 (CHEMBL670478)
IC50
82±n/a nM
Citation
 von Geldern, TWTasker, ASSorensen, BKWinn, MSzczepankiewicz, BGDixon, DBChiou, WJWang, LWessale, JLAdler, AMarsh, KCNguyen, BOpgenorth, TJ Pyrrolidine-3-carboxylic acids as endothelin antagonists. 4. Side chain conformational restriction leads to ET(B) selectivity. J Med Chem 42:3668-78 (1999)  
Target
Name:
Endothelin receptor type B
Synonyms:
EDNRB ENDOTHELIN B ETRB Endothelin receptor non-selective type | Endothelin receptor, ET-A/ET-B
Type:
Enzyme Catalytic Domain
Mol. Mass.:
49664.00
Organism:
Homo sapiens (Human)
Description:
ENDOTHELIN B EDNRB HUMAN::P24530
Residue:
442
  
Inhibitor
Name:
BDBM50080607
Synonyms:
(2R,3R,4S)-4-Benzo[1,3]dioxol-5-yl-1-[(2,5-dimethyl-phenylcarbamoyl)-methyl]-2-(4-methoxy-phenyl)-pyrrolidine-3-carboxylic acid | CHEMBL122111
Type:
Small organic molecule
Emp. Form.:
C29H30N2O6
Mol. Mass.:
502.5583
SMILES:
COc1ccc(cc1)[C@H]1[C@@H]([C@H](CN1CC(=O)Nc1cc(C)ccc1C)c1ccc2OCOc2c1)C(O)=O
: