Target
Endothelin-1 receptor
Ligand
BDBM50080597
Substrate
Meas. Tech.
ChEMBL_65475 (CHEMBL677305)
IC50
4200±n/a nM
Citation
 von Geldern, TWTasker, ASSorensen, BKWinn, MSzczepankiewicz, BGDixon, DBChiou, WJWang, LWessale, JLAdler, AMarsh, KCNguyen, BOpgenorth, TJ Pyrrolidine-3-carboxylic acids as endothelin antagonists. 4. Side chain conformational restriction leads to ET(B) selectivity. J Med Chem 42:3668-78 (1999)  
Target
Name:
Endothelin-1 receptor
Synonyms:
EDNRA ET-A ETA-R Endothelin receptor type A hET-AR
Type:
Enzyme Catalytic Domain
Mol. Mass.:
48736.88
Organism:
Homo sapiens (Human)
Description:
P25101
Residue:
427
  
Inhibitor
Name:
BDBM50080597
Synonyms:
(2R,3R,4S)-4-Benzo[1,3]dioxol-5-yl-1-[(2,6-diethyl-phenylcarbamoyl)-methyl]-2-[4-(2-methoxy-ethoxy)-phenyl]-pyrrolidine-3-carboxylic acid | CHEMBL331625
Type:
Small organic molecule
Emp. Form.:
C33H38N2O7
Mol. Mass.:
574.664
SMILES:
CCc1cccc(CC)c1NC(=O)CN1C[C@@H]([C@H]([C@@H]1c1ccc(OCCOC)cc1)C(O)=O)c1ccc2OCOc2c1
: