Target
Prothrombin
Ligand
BDBM50080884
Substrate
Meas. Tech.
ChEBML_208526
Ki
0.900000±n/a nM
Citation
 Lee, KJung, WHHwang, SYLee, SH Fluorobenzamidrazone thrombin inhibitors: influence of fluorine on enhancing oral absorption. Bioorg Med Chem Lett 9:2483-6 (1999)  
Target
Name:
Prothrombin
Synonyms:
Activation peptide fragment 1 Coagulation factor II Prothrombin precursor Thrombin heavy chain | Thrombin light chain
Type:
Protein
Mol. Mass.:
70029.57
Organism:
Homo sapiens (Human)
Description:
P00734
Residue:
622
  
Inhibitor
Name:
BDBM50080884
Synonyms:
Benzamidrazone analogue | CHEMBL314189
Type:
Small organic molecule
Emp. Form.:
C26H34FN5O3S
Mol. Mass.:
515.643
SMILES:
CN(C1CCCC1)C(=O)[C@H](Cc1ccc(C(N)=NN)c(F)c1)NS(=O)(=O)c1ccc2CCCCc2c1
: